We planned to upgrade GitLab and Mattermost to the latest version this Friday morning (early). You may experience some downtime!

Add strictness to deserialize (lazy variant) and DV_Ok

10 jobs for research-internship in 3 minutes and 21 seconds (queued for 2 seconds)
latest
Status Job ID Name Coverage
  Build
passed #44978
build

00:01:42

passed #44979
build-clang

00:01:20

passed #44980
build-windows

00:00:21

 
  Test Interpreter
failed #44982
benchmark-x64

00:00:42

failed #44983
benchmark-x86

00:01:06

failed #44981
test-gc

00:00:31

 
  Test Interworking
skipped #44985
interworking-GraphCopy
skipped #44986
interworking-GraphCopy-clang
skipped #44984
interworking-Start
 
  Examples
skipped #44987
examples
 
Name Stage Failure
failed
benchmark-x86 Test Interpreter
FAILED: unboxed_arrays (compilation)
Running war_seq...
Unable to find project environment for target 'ByteCode' in available environments.
FAILED: war_seq (compilation)
Running weird_types...
Unable to find project environment for target 'ByteCode' in available environments.
FAILED: weird_types (compilation)
Some tests failed: acker arrays brainfuck cafs chars compress e fills fsieve functions hamming iks infprimes invperm long_integers lqueen match matchlarge mulmat nfib parser pascal prolog reals reverse reverse2 reversearray revrec revtwice rfib sieve squeen str_arit strings stwice sudoku symsieve tak twice unboxed_arrays war_seq weird_types
ERROR: Job failed: exit code 1
failed
benchmark-x64 Test Interpreter
FAILED: unboxed_arrays (compilation)
Running war_seq...
Unable to find project environment for target 'ByteCode' in available environments.
FAILED: war_seq (compilation)
Running weird_types...
Unable to find project environment for target 'ByteCode' in available environments.
FAILED: weird_types (compilation)
Some tests failed: acker arrays brainfuck cafs chars compress e fills fsieve functions hamming iks infprimes invperm long_integers lqueen match matchlarge mulmat nfib parser pascal prolog reals reverse reverse2 reversearray revrec revtwice rfib sieve squeen str_arit strings stwice sudoku symsieve tak twice unboxed_arrays war_seq weird_types
ERROR: Job failed: exit code 1
failed
test-gc Test Interpreter
cc -std=c99 -Wall -Wno-strict-aliasing -Werror -DDEBUG_GARBAGE_COLLECTOR_MARKING -DPOSIX -D_POSIX_C_SOURCE=199309L -D_XOPEN_SOURCE=500 -D_C99_SOURCE -Wno-misleading-indentation -lm -UCOMPUTED_GOTOS abc_instructions.c bcgen_instructions.c bcstrip.c bytecode.c parse.c strip.c util.c -o bcstrip
cc -std=c99 -Wall -Wno-strict-aliasing -Werror -DDEBUG_GARBAGE_COLLECTOR_MARKING -DPOSIX -D_POSIX_C_SOURCE=199309L -D_XOPEN_SOURCE=500 -D_C99_SOURCE -Wno-misleading-indentation -lm -DINTERPRETER abc_instructions.c bytecode.c gc.c gc/copy.c gc/mark.c interpret.c parse.c traps.c util.c -o interpret
cc -std=c99 -Wall -Wno-strict-aliasing -Werror -DDEBUG_GARBAGE_COLLECTOR_MARKING -DPOSIX -D_POSIX_C_SOURCE=199309L -D_XOPEN_SOURCE=500 -D_C99_SOURCE -Wno-misleading-indentation -lm -UCOMPUTED_GOTOS -DINTERPRETER -DDEBUG_CURSES -lcurses abc_instructions.c bytecode.c gc.c gc/copy.c gc/mark.c interpret.c parse.c traps.c util.c debug_curses.c -o debug
make: Leaving directory '/builds/clean-and-itasks/abc-interpreter/src'
Running weird_types...
Unable to find project environment for target 'ByteCode' in available environments.
FAILED: weird_types (compilation)
Some tests failed: weird_types
ERROR: Job failed: exit code 1