Add ccall arguments to bytecode

11 jobs for file-io in 1 minute and 44 seconds (queued for 5 minutes)
Status Job ID Name Coverage
  Build
failed #65196
build

00:00:26

failed #65197
build-clang

00:00:25

failed #65199
build-wasm

00:00:26

failed #65198
build-windows

00:00:25

 
  Test Interpreter
skipped #65202
benchmark-wasm
skipped #65200
benchmark-x64
skipped #65201
benchmark-x86
 
  Test Interworking
skipped #65204
interworking-GraphCopy
skipped #65205
interworking-GraphCopy-clang
skipped #65203
interworking-Start
 
  Examples
skipped #65206
examples
 
Name Stage Failure
failed
build-wasm Build
In file included from interpret.c:524:0:
interpret.c: In function 'interpret':
interpret_instructions.h:13149:2: error: label 'IO_error_halt' used but not defined
IO_error("writeFS fallthrough");
^~~~~~~~
Makefile:158: recipe for target 'interpret' failed
make: *** [interpret] Error 1
make: Leaving directory '/builds/clean-and-itasks/abc-interpreter/src'
ERROR: Job failed: exit code 1
failed
build-windows Build
In file included from interpret.c:524:0:
interpret.c: In function 'interpret':
interpret_instructions.h:13149:2: error: label 'IO_error_halt' used but not defined
IO_error("writeFS fallthrough");
^~~~~~~~
Makefile:158: recipe for target 'interpret' failed
make: Leaving directory '/builds/clean-and-itasks/abc-interpreter/src'
make: *** [interpret] Error 1
ERROR: Job failed: exit code 1
failed
build-clang Build
In file included from interpret.c:524:0:
interpret.c: In function 'interpret':
interpret_instructions.h:13149:2: error: label 'IO_error_halt' used but not defined
IO_error("writeFS fallthrough");
^~~~~~~~
Makefile:158: recipe for target 'interpret' failed
make: Leaving directory '/builds/clean-and-itasks/abc-interpreter/src'
make: *** [interpret] Error 1
ERROR: Job failed: exit code 1
failed
build Build
In file included from interpret.c:524:0:
interpret.c: In function 'interpret':
interpret_instructions.h:13149:2: error: label 'IO_error_halt' used but not defined
IO_error("writeFS fallthrough");
^~~~~~~~
Makefile:158: recipe for target 'interpret' failed
make: *** [interpret] Error 1
make: Leaving directory '/builds/clean-and-itasks/abc-interpreter/src'
ERROR: Job failed: exit code 1