Interpreter generator: specify types to resolve overloading

11 jobs for optimise-wasm-interpreter in 1 minute and 8 seconds (queued for 3 seconds)
Status Job ID Name Coverage
  Build
failed #57082
build

00:00:17

failed #57083
build-clang

00:00:17

failed #57085
build-wasm

00:00:17

failed #57084
build-windows

00:00:17

 
  Test Interpreter
skipped #57088
benchmark-wasm
skipped #57086
benchmark-x64
skipped #57087
benchmark-x86
 
  Test Interworking
skipped #57090
interworking-GraphCopy
skipped #57091
interworking-GraphCopy-clang
skipped #57089
interworking-Start
 
  Examples
skipped #57092
examples
 
Name Stage Failure
failed
build-wasm Build
Parse error [interpretergen.dcl,39;0,type definition (6)]: end of definition expected instead of Scanner error: end of file encountered inside comment
Compiling interpretergen
make[1]: *** [interpretergenc] Error 1
Makefile:14: recipe for target 'interpretergenc' failed
make[1]: Leaving directory '/builds/clean-and-itasks/abc-interpreter/tools'
Makefile:176: recipe for target 'interpret_instructions.h' failed
make: Leaving directory '/builds/clean-and-itasks/abc-interpreter/src'
make: *** [interpret_instructions.h] Error 2
ERROR: Job failed: exit code 1
failed
build-windows Build
Parse error [interpretergen.dcl,39;0,type definition (6)]: end of definition expected instead of Scanner error: end of file encountered inside comment
Compiling interpretergen
make[1]: *** [interpretergenc] Error 1
Makefile:14: recipe for target 'interpretergenc' failed
make[1]: Leaving directory '/builds/clean-and-itasks/abc-interpreter/tools'
Makefile:176: recipe for target 'interpret_instructions.h' failed
make: *** [interpret_instructions.h] Error 2
make: Leaving directory '/builds/clean-and-itasks/abc-interpreter/src'
ERROR: Job failed: exit code 1
failed
build-clang Build
Parse error [interpretergen.dcl,39;0,type definition (6)]: end of definition expected instead of Scanner error: end of file encountered inside comment
Compiling interpretergen
Makefile:14: recipe for target 'interpretergenc' failed
make[1]: Leaving directory '/builds/clean-and-itasks/abc-interpreter/tools'
make[1]: *** [interpretergenc] Error 1
Makefile:176: recipe for target 'interpret_instructions.h' failed
make: Leaving directory '/builds/clean-and-itasks/abc-interpreter/src'
make: *** [interpret_instructions.h] Error 2
ERROR: Job failed: exit code 1
failed
build Build
Parse error [interpretergen.dcl,39;0,type definition (6)]: end of definition expected instead of Scanner error: end of file encountered inside comment
Compiling interpretergen
Makefile:14: recipe for target 'interpretergenc' failed
make[1]: Leaving directory '/builds/clean-and-itasks/abc-interpreter/tools'
make[1]: *** [interpretergenc] Error 1
Makefile:176: recipe for target 'interpret_instructions.h' failed
make: Leaving directory '/builds/clean-and-itasks/abc-interpreter/src'
make: *** [interpret_instructions.h] Error 2
ERROR: Job failed: exit code 1